Jump to content
  • 0

Вопросы по keenetic SDK

Denis P


Распаковал образ 3.9.8 delta для 1610. При попытке заново его собрать (используя для этого branch 3.09.C.8.0-0) 

получаем ошибку при сборке пакета libcurl: 

Скрытый текст

Package libcurl is missing dependencies for the following libraries:
make[2]: *** [Makefile:158: /home/debian/keenetic-sdk/bin/mt7628/packages/libcurl_7.82.0-1_KN-1610.ipk] Error 1
make[2]: Leaving directory '/home/debian/keenetic-sdk/package/libs/curl'
time: package/libs/curl/compile#0.20#0.05#0.18
make[1]: *** [package/Makefile:145: package/libs/curl/compile] Error 2
make[1]: Leaving directory '/home/debian/keenetic-sdk'
make: *** [/home/debian/keenetic-sdk/include/toplevel.mk:170: package/libs/curl/compile] Error 2

при сборке stable прошивок такой проблемы нет, предположу что в delta были какие-то изменения


подскажите пожалуйста как вылечить

Edited by Denis P
Link to comment
Share on other sites

4 answers to this question

Recommended Posts

  • 0

забил на delta, решил пересобрать 3.8.7, но не тут то было:


Скрытый текст

mkdir -p /home/debian/keenetic-sdk/tmp/mklibs-out                                                                                                

 /home/debian/keenetic-sdk/staging_dir/host/bin/mklibs -D -d /home/debian/keenetic-sdk/tmp/mklibs-out --sysroot /home/debian/keenetic-sdk/staging_dir/target-mipsel-linux-musl_musl/root-mt7628 `cat /home/debian/keenetic-sdk/tmp/mklibs-libs | sed 's:/*[^/]\+/*$::' | uniq | sed 's:^/home/debian/keenetic-sdk/staging_dir/target-mipsel-linux-musl_musl/root-mt7628:-L :'` --ldlib /lib/ld-musl-mipsel-sf.so.1 --libc-extras-dir /lib --target mipsel-ndms-linux-musl `cat /home/debian/keenetic-sdk/tmp/mklibs-progs /home/debian/keenetic-sdk/tmp/mklibs-libs` 2>&1      

  File "/home/debian/keenetic-sdk/staging_dir/host/bin/mklibs", line 60                                                                                                      

           print string.join(msg)                                                                                                                                                                                                                                                        ^^^^^^^^^^^^^^^^^^^^^^                                                                                                                                           

SyntaxError: Missing parentheses in call to 'print'. Did you mean print(...)?                                                                                                    

make[2]: *** [package/Makefile:114: package/install] Error 1       


Link to comment
Share on other sites

  • 0

продолжу диалог сам с собой, вдруг кому-то тоже пригодится.

Дело оказалось в том, что mklibs не переписан под python3, c 2.7 всё собралось успешно

Link to comment
Share on other sites

Join the conversation

You can post now and register later. If you have an account, sign in now to post with your account.
Note: Your post will require moderator approval before it will be visible.

Answer this question...

×   Pasted as rich text.   Paste as plain text instead

  Only 75 emoji are allowed.

×   Your link has been automatically embedded.   Display as a link instead

×   Your previous content has been restored.   Clear editor

×   You cannot paste images directly. Upload or insert images from URL.

  • Recently Browsing   0 members

    • No registered users viewing this page.
  • Create New...